Reaction Details
TargetRho-associated protein kinase 2
LigandBDBM50434485
Substrate/Competitorn/a
Meas. Tech.ChEMBL_961508 (CHEMBL2388366)
IC50>20000±n/a nM
Citation Xiao, DPalani, AHuang, XSofolarides, MZhou, WChen, XAslanian, RGuo, ZFossetta, JTian, FTrivedi, PSpacciapoli, PWhitehurst, CELundell, D Conformation constraint of anilides enabling the discovery of tricyclic lactams as potent MK2 non-ATP competitive inhibitors. Bioorg Med Chem Lett23:3262-6 (2013) 
 
Rho-associated protein kinase 2
Name:Rho-associated protein kinase 2
Type:Protein
Mol. Mass.:160885.43
Organism:Homo sapiens (Human)
Description:O75116
Residue:1388
BDBM50434485
NameBDBM50434485
Synonyms:CHEMBL2385543
TypeSmall organic molecule
Emp. Form.C34H29ClN4O2
Mol. Mass.561.073
SMILESClc1ccc(cc1)-c1cc2Cc3cc(ccc3N(Cc3ccccc3-c3cccnc3)C(=O)c2o1)N1CCNCC1