Reaction Details
TargetMAP kinase-activated protein kinase 2
LigandBDBM50434488
Substrate/Competitorn/a
Meas. Tech.ChEMBL_961826 (CHEMBL2389966)
IC50 3.0±n/a nM
Citation Xiao, DPalani, AHuang, XSofolarides, MZhou, WChen, XAslanian, RGuo, ZFossetta, JTian, FTrivedi, PSpacciapoli, PWhitehurst, CELundell, D Conformation constraint of anilides enabling the discovery of tricyclic lactams as potent MK2 non-ATP competitive inhibitors. Bioorg Med Chem Lett23:3262-6 (2013) 
 
MAP kinase-activated protein kinase 2
Name:MAP kinase-activated protein kinase 2
Type:Serine/threonine-protein kinase
Mol. Mass.:45579.87
Organism:Homo sapiens (Human)
Description:P49137
Residue:400
BDBM50434488
NameBDBM50434488
Synonyms:CHEMBL2385549
TypeSmall organic molecule
Emp. Form.C35H29N5O2
Mol. Mass.551.6371
SMILESO=C1N(Cc2ccccc2-c2cncnc2)c2ccc(cc2Cc2cc(oc12)-c1ccc(cc1)C#N)C1CCNCC1