Reaction Details
TargetMAP kinase-activated protein kinase 2
LigandBDBM50434495
Substrate/Competitorn/a
Meas. Tech.ChEMBL_961826 (CHEMBL2389966)
IC50 21±n/a nM
Citation Xiao, DPalani, AHuang, XSofolarides, MZhou, WChen, XAslanian, RGuo, ZFossetta, JTian, FTrivedi, PSpacciapoli, PWhitehurst, CELundell, D Conformation constraint of anilides enabling the discovery of tricyclic lactams as potent MK2 non-ATP competitive inhibitors. Bioorg Med Chem Lett23:3262-6 (2013) 
 
MAP kinase-activated protein kinase 2
Name:MAP kinase-activated protein kinase 2
Type:Serine/threonine-protein kinase
Mol. Mass.:45579.87
Organism:Homo sapiens (Human)
Description:P49137
Residue:400
BDBM50434495
NameBDBM50434495
Synonyms:CHEMBL2385541
TypeSmall organic molecule
Emp. Form.C35H31ClN4O3
Mol. Mass.591.099
SMILESCOc1cc(ccn1)-c1ccccc1CN1c2ccc(cc2Cc2cc(oc2C1=O)-c1ccc(Cl)cc1)N1CCNCC1