Reaction Details
TargetReceptor-type tyrosine-protein kinase FLT3
LigandBDBM50434611
Substrate/Competitorn/a
Meas. Tech.ChEMBL_963010 (CHEMBL2390018)
IC50 35±n/a nM
Citation Lin, WHHsu, JTHsieh, SYChen, CTSong, JSYen, SCHsu, TLu, CTChen, CHChou, LHYang, YNChiu, CHChen, CPTseng, YJYen, KJYeh, CFChao, YSYeh, TKJiaang, WT Discovery of 3-phenyl-1H-5-pyrazolylamine derivatives containing a urea pharmacophore as potent and efficacious inhibitors of FMS-like tyrosine kinase-3 (FLT3). Bioorg Med Chem21:2856-67 (2013) 
 
Receptor-type tyrosine-protein kinase FLT3
Name:Receptor-type tyrosine-protein kinase FLT3
Type:Enzyme
Mol. Mass.:112888.62
Organism:Homo sapiens (Human)
Description:P36888
Residue:993
BDBM50434611
NameBDBM50434611
Synonyms:CHEMBL2386806
TypeSmall organic molecule
Emp. Form.C28H36N10O2
Mol. Mass.544.6512
SMILESCN1CCN(CC1)c1cc(Nc2cc(n[nH]2)-c2ccc(CNC(=O)Nc3cc(on3)C(C)(C)C)cc2)nc(C)n1