Reaction Details
TargetReceptor-type tyrosine-protein kinase FLT3
LigandBDBM50434625
Substrate/Competitorn/a
Meas. Tech.ChEMBL_963010 (CHEMBL2390018)
IC50 15±n/a nM
Citation Lin, WHHsu, JTHsieh, SYChen, CTSong, JSYen, SCHsu, TLu, CTChen, CHChou, LHYang, YNChiu, CHChen, CPTseng, YJYen, KJYeh, CFChao, YSYeh, TKJiaang, WT Discovery of 3-phenyl-1H-5-pyrazolylamine derivatives containing a urea pharmacophore as potent and efficacious inhibitors of FMS-like tyrosine kinase-3 (FLT3). Bioorg Med Chem21:2856-67 (2013) 
 
Receptor-type tyrosine-protein kinase FLT3
Name:Receptor-type tyrosine-protein kinase FLT3
Type:Enzyme
Mol. Mass.:112888.62
Organism:Homo sapiens (Human)
Description:P36888
Residue:993
BDBM50434625
NameBDBM50434625
Synonyms:CHEMBL2386792
TypeSmall organic molecule
Emp. Form.C30H35N7O4
Mol. Mass.557.6434
SMILESCC(C)(C)c1cc(NC(=O)Nc2ccc(cc2)-c2cc(NC(=O)c3ccc(OCCN4CCCC4)cc3)[nH]n2)no1