Reaction Details
TargetAurora kinase A
LigandBDBM50434624
Substrate/Competitorn/a
Meas. Tech.ChEMBL_963008 (CHEMBL2390016)
IC50 160±n/a nM
Citation Lin, WHHsu, JTHsieh, SYChen, CTSong, JSYen, SCHsu, TLu, CTChen, CHChou, LHYang, YNChiu, CHChen, CPTseng, YJYen, KJYeh, CFChao, YSYeh, TKJiaang, WT Discovery of 3-phenyl-1H-5-pyrazolylamine derivatives containing a urea pharmacophore as potent and efficacious inhibitors of FMS-like tyrosine kinase-3 (FLT3). Bioorg Med Chem21:2856-67 (2013) 
 
Aurora kinase A
Name:Aurora kinase A
Type:Serine/threonine-protein kinase
Mol. Mass.:45830.98
Organism:Homo sapiens (Human)
Description:O14965
Residue:403
BDBM50434624
NameBDBM50434624
Synonyms:CHEMBL2386793
TypeSmall organic molecule
Emp. Form.C30H35N7O5
Mol. Mass.573.6428
SMILESCC(C)(C)c1cc(NC(=O)Nc2ccc(cc2)-c2cc(NC(=O)c3ccc(OCCN4CCOCC4)cc3)[nH]n2)no1