Reaction Details
TargetSerine/threonine-protein kinase pim-3
LigandBDBM50434664
Substrate/Competitorn/a
Meas. Tech.ChEMBL_960798 (CHEMBL2387967)
Ki 0.098000±n/a nM
Citation Wang, XMagnuson, SPastor, RFan, EHu, HTsui, VDeng, WMurray, JSteffek, MWallweber, HMoffat, JDrummond, JChan, GHarstad, EEbens, AJ Discovery of novel pyrazolo[1,5-a]pyrimidines as potent pan-Pim inhibitors by structure- and property-based drug design. Bioorg Med Chem Lett23:3149-53 (2013) 
 
Serine/threonine-protein kinase pim-3
Name:Serine/threonine-protein kinase pim-3
Type:Protein
Mol. Mass.:35888.19
Organism:Homo sapiens (Human)
Description:Q86V86
Residue:326
BDBM50434664
NameBDBM50434664
Synonyms:CHEMBL2387473
TypeSmall organic molecule
Emp. Form.C26H24F2N8O
Mol. Mass.502.5186
SMILESFc1cccc(F)c1-c1ccc2[nH]cc(NC(=O)c3cnn4ccc(NCC5CCNCC5)nc34)c2n1