Reaction Details
TargetSerine/threonine-protein kinase pim-3
LigandBDBM50434651
Substrate/Competitorn/a
Meas. Tech.ChEMBL_960798 (CHEMBL2387967)
Ki 0.610000±n/a nM
Citation Wang, XMagnuson, SPastor, RFan, EHu, HTsui, VDeng, WMurray, JSteffek, MWallweber, HMoffat, JDrummond, JChan, GHarstad, EEbens, AJ Discovery of novel pyrazolo[1,5-a]pyrimidines as potent pan-Pim inhibitors by structure- and property-based drug design. Bioorg Med Chem Lett23:3149-53 (2013) 
 
Serine/threonine-protein kinase pim-3
Name:Serine/threonine-protein kinase pim-3
Type:Protein
Mol. Mass.:35888.19
Organism:Homo sapiens (Human)
Description:Q86V86
Residue:326
BDBM50434651
NameBDBM50434651
Synonyms:CHEMBL2387468
TypeSmall organic molecule
Emp. Form.C22H15N7O2
Mol. Mass.409.4002
SMILESO=C(Nc1c[nH]c2ncccc12)c1c[nH]n2c1nc(Cc1ccc(cc1)C#N)cc2=O