Reaction Details
TargetSerine/threonine-protein kinase pim-2
LigandBDBM50434663
Substrate/Competitorn/a
Meas. Tech.ChEMBL_960800 (CHEMBL2387969)
Ki 0.170000±n/a nM
Citation Wang, XMagnuson, SPastor, RFan, EHu, HTsui, VDeng, WMurray, JSteffek, MWallweber, HMoffat, JDrummond, JChan, GHarstad, EEbens, AJ Discovery of novel pyrazolo[1,5-a]pyrimidines as potent pan-Pim inhibitors by structure- and property-based drug design. Bioorg Med Chem Lett23:3149-53 (2013) 
 
Serine/threonine-protein kinase pim-2
Name:Serine/threonine-protein kinase pim-2
Type:Serine/threonine-protein kinase
Mol. Mass.:34185.93
Organism:Homo sapiens (Human)
Description:Q9P1W9
Residue:311
BDBM50434663
NameBDBM50434663
Synonyms:CHEMBL2387474
TypeSmall organic molecule
Emp. Form.C27H25F2N7O
Mol. Mass.501.5305
SMILESFc1cccc(F)c1-c1cnc2[nH]cc(NC(=O)c3cnn4ccc(CCC5CCNCC5)nc34)c2c1