Reaction Details
TargetSerine/threonine-protein kinase pim-2
LigandBDBM50434666
Substrate/Competitorn/a
Meas. Tech.ChEMBL_960800 (CHEMBL2387969)
Ki 0.076000±n/a nM
Citation Wang, XMagnuson, SPastor, RFan, EHu, HTsui, VDeng, WMurray, JSteffek, MWallweber, HMoffat, JDrummond, JChan, GHarstad, EEbens, AJ Discovery of novel pyrazolo[1,5-a]pyrimidines as potent pan-Pim inhibitors by structure- and property-based drug design. Bioorg Med Chem Lett23:3149-53 (2013) 
 
Serine/threonine-protein kinase pim-2
Name:Serine/threonine-protein kinase pim-2
Type:Serine/threonine-protein kinase
Mol. Mass.:34185.93
Organism:Homo sapiens (Human)
Description:Q9P1W9
Residue:311
BDBM50434666
NameBDBM50434666
Synonyms:CHEMBL2387471
TypeSmall organic molecule
Emp. Form.C26H24F2N8O
Mol. Mass.502.5186
SMILESFc1cccc(F)c1-c1cnc2[nH]cc(NC(=O)c3cnn4ccc(NCC5CCNCC5)nc34)c2c1