Reaction Details
TargetSerine/threonine-protein kinase pim-1
LigandBDBM50434655
Substrate/Competitorn/a
Meas. Tech.ChEMBL_960801 (CHEMBL2388109)
Ki 0.003000±n/a nM
Citation Wang, XMagnuson, SPastor, RFan, EHu, HTsui, VDeng, WMurray, JSteffek, MWallweber, HMoffat, JDrummond, JChan, GHarstad, EEbens, AJ Discovery of novel pyrazolo[1,5-a]pyrimidines as potent pan-Pim inhibitors by structure- and property-based drug design. Bioorg Med Chem Lett23:3149-53 (2013) 
 
Serine/threonine-protein kinase pim-1
Name:Serine/threonine-protein kinase pim-1
Type:Protein
Mol. Mass.:35681.82
Organism:Homo sapiens (Human)
Description:P11309
Residue:313
BDBM50434655
NameBDBM50434655
Synonyms:CHEMBL2387464
TypeSmall organic molecule
Emp. Form.C26H24F2N8O
Mol. Mass.502.5186
SMILESF[C@H]1CNCC[C@@H]1CNc1ccn2ncc(C(=O)Nc3c[nH]c4ncc(cc34)-c3ccccc3F)c2n1