Reaction Details
TargetSerine/threonine-protein kinase pim-1
LigandBDBM50434665
Substrate/Competitorn/a
Meas. Tech.ChEMBL_960801 (CHEMBL2388109)
Ki 0.061000±n/a nM
Citation Wang, XMagnuson, SPastor, RFan, EHu, HTsui, VDeng, WMurray, JSteffek, MWallweber, HMoffat, JDrummond, JChan, GHarstad, EEbens, AJ Discovery of novel pyrazolo[1,5-a]pyrimidines as potent pan-Pim inhibitors by structure- and property-based drug design. Bioorg Med Chem Lett23:3149-53 (2013) 
 
Serine/threonine-protein kinase pim-1
Name:Serine/threonine-protein kinase pim-1
Type:Protein
Mol. Mass.:35681.82
Organism:Homo sapiens (Human)
Description:P11309
Residue:313
BDBM50434665
NameBDBM50434665
Synonyms:CHEMBL2387472
TypeSmall organic molecule
Emp. Form.C27H25F2N7O
Mol. Mass.501.5305
SMILESFc1cccc(F)c1-c1ccc2[nH]cc(NC(=O)c3cnn4ccc(NCC5CCNCC5)nc34)c2c1