Reaction Details
TargetProstaglandin E synthase
LigandBDBM50434681
Substrate/Competitorn/a
Meas. Tech.ChEMBL_961192 (CHEMBL2389928)
IC50 21±n/a nM
Citation Shiro, TKakiguchi, KTakahashi, HNagata, HTobe, M 7-Phenyl-imidazoquinolin-4(5H)-one derivatives as selective and orally available mPGES-1 inhibitors. Bioorg Med Chem21:2868-78 (2013) 
 
Prostaglandin E synthase
Name:Prostaglandin E synthase
Type:Protein
Mol. Mass.:17112.22
Organism:Homo sapiens (Human)
Description:n/a
Residue:152
BDBM50434681
NameBDBM50434681
Synonyms:CHEMBL2387603
TypeSmall organic molecule
Emp. Form.C20H12ClN3OS
Mol. Mass.377.847
SMILESClc1ccccc1-c1nc2c([nH]1)c(=O)[nH]c1cc(ccc21)-c1cccs1