Reaction Details
TargetBone morphogenetic protein receptor type-2
LigandBDBM50434749
Substrate/Competitorn/a
Meas. Tech.ChEMBL_961929 (CHEMBL2390520)
IC50 59±n/a nM
Citation Engers, DWFrist, AYLindsley, CWHong, CCHopkins, CR Synthesis and structure-activity relationships of a novel and selective bone morphogenetic protein receptor (BMP) inhibitor derived from the pyrazolo[1.5-a]pyrimidine scaffold of dorsomorphin: the discovery of ML347 as an ALK2 versus ALK3 selective MLPCN probe. Bioorg Med Chem Lett23:3248-52 (2013) 
 
Bone morphogenetic protein receptor type-2
Name:Bone morphogenetic protein receptor type-2
Type:PROTEIN
Mol. Mass.:115194.11
Organism:Homo sapiens (Human)
Description:ChEMBL_774306
Residue:1038
BDBM50434749
NameBDBM50434749
Synonyms:CHEMBL2385586
TypeSmall organic molecule
Emp. Form.C19H19N7
Mol. Mass.345.4011
SMILESC1CN(CCN1)c1ccc(cc1)-c1cnc2c(cnn2c1)-c1cn[nH]c1