Reaction Details
TargetBone morphogenetic protein receptor type-1B
LigandBDBM50262016
Substrate/Competitorn/a
Meas. Tech.ChEMBL_961931 (CHEMBL2390522)
IC50 57±n/a nM
Citation Engers, DWFrist, AYLindsley, CWHong, CCHopkins, CR Synthesis and structure-activity relationships of a novel and selective bone morphogenetic protein receptor (BMP) inhibitor derived from the pyrazolo[1.5-a]pyrimidine scaffold of dorsomorphin: the discovery of ML347 as an ALK2 versus ALK3 selective MLPCN probe. Bioorg Med Chem Lett23:3248-52 (2013) 
 
Bone morphogenetic protein receptor type-1B
Name:Bone morphogenetic protein receptor type-1B
Type:Enzyme
Mol. Mass.:56939.41
Organism:Homo sapiens (Human)
Description:O00238
Residue:502
BDBM50262016
NameBDBM50262016
Synonyms:4-(6-(4-methoxyphenyl)pyrazolo[1,5-a]pyrimidin-3-yl)quinoline | CHEMBL511563
TypeSmall organic molecule
Emp. Form.C22H16N4O
Mol. Mass.352.3886
SMILESCOc1ccc(cc1)-c1cnc2c(cnn2c1)-c1ccnc2ccccc12