Reaction Details
TargetTGF-beta receptor type-2
LigandBDBM50434752
Substrate/Competitorn/a
Meas. Tech.ChEMBL_961927 (CHEMBL2390518)
IC50 26±n/a nM
Citation Engers, DWFrist, AYLindsley, CWHong, CCHopkins, CR Synthesis and structure-activity relationships of a novel and selective bone morphogenetic protein receptor (BMP) inhibitor derived from the pyrazolo[1.5-a]pyrimidine scaffold of dorsomorphin: the discovery of ML347 as an ALK2 versus ALK3 selective MLPCN probe. Bioorg Med Chem Lett23:3248-52 (2013) 
 
TGF-beta receptor type-2
Name:TGF-beta receptor type-2
Type:PROTEIN
Mol. Mass.:64559.49
Organism:Homo sapiens (Human)
Description:ChEMBL_586859
Residue:567
BDBM50434752
NameBDBM50434752
Synonyms:CHEMBL2385582
TypeSmall organic molecule
Emp. Form.C25H21N5O
Mol. Mass.407.4671
SMILESC1CN(CCO1)c1ccc(cc1)-c1cnc2c(cnn2c1)-c1ccnc2ccccc12