Reaction Details
Target5'-AMP-activated protein kinase subunit beta-1
LigandBDBM50262016
Substrate/Competitorn/a
Meas. Tech.ChEMBL_961928 (CHEMBL2390519)
IC50 7260±n/a nM
Citation Engers, DWFrist, AYLindsley, CWHong, CCHopkins, CR Synthesis and structure-activity relationships of a novel and selective bone morphogenetic protein receptor (BMP) inhibitor derived from the pyrazolo[1.5-a]pyrimidine scaffold of dorsomorphin: the discovery of ML347 as an ALK2 versus ALK3 selective MLPCN probe. Bioorg Med Chem Lett23:3248-52 (2013) 
 
5'-AMP-activated protein kinase subunit beta-1
Name:5'-AMP-activated protein kinase subunit beta-1
Type:n/a
Mol. Mass.:30380.94
Organism:Homo sapiens (Human)
Description:Q9Y478
Residue:270
BDBM50262016
NameBDBM50262016
Synonyms:4-(6-(4-methoxyphenyl)pyrazolo[1,5-a]pyrimidin-3-yl)quinoline | CHEMBL511563
TypeSmall organic molecule
Emp. Form.C22H16N4O
Mol. Mass.352.3886
SMILESCOc1ccc(cc1)-c1cnc2c(cnn2c1)-c1ccnc2ccccc12