Reaction Details
TargetSerine/threonine-protein kinase receptor R3
LigandBDBM50262685
Substrate/Competitorn/a
Meas. Tech.ChEMBL_961935 (CHEMBL2390526)
IC50 106±n/a nM
Citation Engers, DWFrist, AYLindsley, CWHong, CCHopkins, CR Synthesis and structure-activity relationships of a novel and selective bone morphogenetic protein receptor (BMP) inhibitor derived from the pyrazolo[1.5-a]pyrimidine scaffold of dorsomorphin: the discovery of ML347 as an ALK2 versus ALK3 selective MLPCN probe. Bioorg Med Chem Lett23:3248-52 (2013) 
 
Serine/threonine-protein kinase receptor R3
Name:Serine/threonine-protein kinase receptor R3
Type:Enzyme
Mol. Mass.:56134.46
Organism:Homo sapiens (Human)
Description:P37023
Residue:503
BDBM50262685
NameBDBM50262685
Synonyms:6-(4-(2-(piperidin-1-yl)ethoxy)phenyl)-3-(pyridin-4-yl)pyrazolo[1,5-a]pyrimidine CHEMBL478629 US9040694, Dorsomorphin
TypeSmall organic molecule
Emp. Form.C24H25N5O
Mol. Mass.399.4882
SMILESC(CN1CCCCC1)Oc1ccc(cc1)-c1cnc2c(cnn2c1)-c1ccncc1