Reaction Details
TargetProteasome subunit beta type-1
LigandBDBM50434768
Substrate/Competitorn/a
Meas. Tech.ChEMBL_962204 (CHEMBL2388792)
Ki 1380±n/a nM
Citation Micale, NEttari, RLavecchia, ADi Giovanni, CScarbaci, KTroiano, VGrasso, SNovellino, ESchirmeister, TZappalà, M Development of peptidomimetic boronates as proteasome inhibitors. Eur J Med Chem64:23-34 (2013) 
 
Proteasome subunit beta type-1
Name:Proteasome subunit beta type-1
Type:PROTEIN
Mol. Mass.:26493.62
Organism:Homo sapiens (Human)
Description:ChEMBL_1366691
Residue:241
BDBM50434768
NameBDBM50434768
Synonyms:CHEMBL2385810
TypeSmall organic molecule
Emp. Form.C12H19BN2O4
Mol. Mass.266.101
SMILESCC(C)C[C@H](NC(=O)Cn1ccccc1=O)B(O)O