Reaction Details
TargetProteasome subunit beta type-5
LigandBDBM50434762
Substrate/Competitorn/a
Meas. Tech.ChEMBL_962205 (CHEMBL2388793)
Ki 1340±n/a nM
Citation Micale, NEttari, RLavecchia, ADi Giovanni, CScarbaci, KTroiano, VGrasso, SNovellino, ESchirmeister, TZappalà, M Development of peptidomimetic boronates as proteasome inhibitors. Eur J Med Chem64:23-34 (2013) 
 
Proteasome subunit beta type-5
Name:Proteasome subunit beta type-5
Type:Protein
Mol. Mass.:28480.96
Organism:Homo sapiens (Human)
Description:n/a
Residue:263
BDBM50434762
NameBDBM50434762
Synonyms:CHEMBL2385818
TypeSmall organic molecule
Emp. Form.C16H22BN3O4
Mol. Mass.331.175
SMILESCC(C)C[C@H](NC(=O)[C@H](C)n1ccc2ncccc2c1=O)B(O)O