Reaction Details
TargetPhosphatidylinositol 4,5-bisphosphate 3-kinase catalytic subunit alpha isoform
LigandBDBM50434808
Substrate/Competitorn/a
Meas. Tech.ChEMBL_962691 (CHEMBL2388269)
Ki 0.300000±n/a nM
Citation Ndubaku, COHeffron, TPStaben, STBaumgardner, MBlaquiere, NBradley, EBull, RDo, SDotson, JDudley, DEdgar, KAFriedman, LSGoldsmith, RHeald, RAKolesnikov, ALee, LLewis, CNannini, MNonomiya, JPang, JPrice, SPrior, WWSalphati, LSideris, SWallin, JJWang, LWei, BSampath, DOlivero, AG Discovery of 2-{3-[2-(1-isopropyl-3-methyl-1H-1,2-4-triazol-5-yl)-5,6-dihydrobenzo[f]imidazo[1,2-d][1,4]oxazepin-9-yl]-1H-pyrazol-1-yl}-2-methylpropanamide (GDC-0032): aß-sparing phosphoinositide 3-kinase inhibitor with high unbound exposure and robust in vivo antitumor activity. J Med Chem56:4597-610 (2013) 
 
Phosphatidylinositol 4,5-bisphosphate 3-kinase catalytic subunit alpha isoform
Name:Phosphatidylinositol 4,5-bisphosphate 3-kinase catalytic subunit alpha isoform
Type:Enzyme Subunit
Mol. Mass.:124294.87
Organism:Homo sapiens (Human)
Description:P42336
Residue:1068
BDBM50434808
NameBDBM50434808
Synonyms:CHEMBL2386972
TypeSmall organic molecule
Emp. Form.C26H32N8O2
Mol. Mass.488.5847
SMILESCC(C)n1nc(C)nc1-c1cn2CCOc3cc(ccc3-c2n1)-c1cnn(CCN2CCOCC2)c1