Reaction Details
TargetPhosphatidylinositol 4,5-bisphosphate 3-kinase catalytic subunit alpha isoform
LigandBDBM50433536
Substrate/Competitorn/a
Meas. Tech.ChEMBL_962688 (CHEMBL2388266)
IC50 16±n/a nM
Citation Ndubaku, COHeffron, TPStaben, STBaumgardner, MBlaquiere, NBradley, EBull, RDo, SDotson, JDudley, DEdgar, KAFriedman, LSGoldsmith, RHeald, RAKolesnikov, ALee, LLewis, CNannini, MNonomiya, JPang, JPrice, SPrior, WWSalphati, LSideris, SWallin, JJWang, LWei, BSampath, DOlivero, AG Discovery of 2-{3-[2-(1-isopropyl-3-methyl-1H-1,2-4-triazol-5-yl)-5,6-dihydrobenzo[f]imidazo[1,2-d][1,4]oxazepin-9-yl]-1H-pyrazol-1-yl}-2-methylpropanamide (GDC-0032): aß-sparing phosphoinositide 3-kinase inhibitor with high unbound exposure and robust in vivo antitumor activity. J Med Chem56:4597-610 (2013) 
 
Phosphatidylinositol 4,5-bisphosphate 3-kinase catalytic subunit alpha isoform
Name:Phosphatidylinositol 4,5-bisphosphate 3-kinase catalytic subunit alpha isoform
Type:Enzyme Subunit
Mol. Mass.:124294.87
Organism:Homo sapiens (Human)
Description:P42336
Residue:1068
BDBM50433536
NameBDBM50433536
Synonyms:CHEMBL2381373
TypeSmall organic molecule
Emp. Form.C21H22N6O2S
Mol. Mass.422.503
SMILESCC(C)n1ncnc1-c1nc-2c(CCOc3cc(ccc-23)-c2cnn(CCO)c2)s1