Reaction Details
TargetTyrosine-protein kinase JAK1
LigandBDBM50355501
Substrate/Competitorn/a
Meas. Tech.ChEMBL_962885 (CHEMBL2389433)
Ki 0.200000±n/a nM
Citation Liang, Jvan Abbema, ABalazs, MBarrett, KBerezhkovsky, LBlair, WChang, CDelarosa, DDeVoss, JDriscoll, JEigenbrot, CGhilardi, NGibbons, PHalladay, JJohnson, AKohli, PBLai, YLiu, YLyssikatos, JMantik, PMenghrajani, KMurray, JPeng, ISambrone, AShia, SShin, YSmith, JSohn, STsui, VUltsch, MWu, LCXiao, YYang, WYoung, JZhang, BZhu, BYMagnuson, S Lead optimization of a 4-aminopyridine benzamide scaffold to identify potent, selective, and orally bioavailable TYK2 inhibitors. J Med Chem56:4521-36 (2013) 
 
Tyrosine-protein kinase JAK1
Name:Tyrosine-protein kinase JAK1
Type:Protein
Mol. Mass.:133293.73
Organism:Homo sapiens (Human)
Description:P23458
Residue:1154
BDBM50355501
NameBDBM50355501
Synonyms:INCB-018424 RUXOLITINIB PHOSPHATE US10766894, Compound TABLE 1.1 US11203595, TABLE 1.1 | US11279703, TABLE 6.147
TypeSmall organic molecule
Emp. Form.C17H18N6
Mol. Mass.306.365
SMILESN#CC[C@H](C1CCCC1)n1cc(cn1)-c1ncnc2[nH]ccc12