Reaction Details
TargetIleal sodium/bile acid cotransporter
LigandBDBM50434849
Substrate/Competitorn/a
Meas. Tech.ChEMBL_963356 (CHEMBL2388853)
IC50 0.500000±n/a nM
Citation Wu, YAquino, CJCowan, DJAnderson, DLAmbroso, JLBishop, MJBoros, EEChen, LCunningham, ADobbins, RLFeldman, PLHarston, LTKaldor, IWKlein, RLiang, XMcIntyre, MSMerrill, CLPatterson, KMPrescott, JSRay, JSRoller, SGYao, XYoung, AYuen, JCollins, JL Discovery of a highly potent, nonabsorbable apical sodium-dependent bile acid transporter inhibitor (GSK2330672) for treatment of type 2 diabetes. J Med Chem56:5094-114 (2013) 
 
Ileal sodium/bile acid cotransporter
Name:Ileal sodium/bile acid cotransporter
Type:PROTEIN
Mol. Mass.:38130.25
Organism:Mus musculus
Description:ChEMBL_963356
Residue:348
BDBM50434849
NameBDBM50434849
Synonyms:CHEMBL2385105 | US9040518, 6
TypeSmall organic molecule
Emp. Form.C23H32NO6PS
Mol. Mass.481.542
SMILESCCCC[C@]1(CC)CS(=O)(=O)c2cc(CP(O)(O)=O)c(OC)cc2[C@H](N1)c1ccccc1