Reaction Details
TargetIleal sodium/bile acid cotransporter
LigandBDBM50434850
Substrate/Competitorn/a
Meas. Tech.ChEMBL_963356 (CHEMBL2388853)
IC50 0.300000±n/a nM
Citation Wu, YAquino, CJCowan, DJAnderson, DLAmbroso, JLBishop, MJBoros, EEChen, LCunningham, ADobbins, RLFeldman, PLHarston, LTKaldor, IWKlein, RLiang, XMcIntyre, MSMerrill, CLPatterson, KMPrescott, JSRay, JSRoller, SGYao, XYoung, AYuen, JCollins, JL Discovery of a highly potent, nonabsorbable apical sodium-dependent bile acid transporter inhibitor (GSK2330672) for treatment of type 2 diabetes. J Med Chem56:5094-114 (2013) 
 
Ileal sodium/bile acid cotransporter
Name:Ileal sodium/bile acid cotransporter
Type:PROTEIN
Mol. Mass.:38130.25
Organism:Mus musculus
Description:ChEMBL_963356
Residue:348
BDBM50434850
NameBDBM50434850
Synonyms:CHEMBL2387397
TypeSmall organic molecule
Emp. Form.C25H34N2O5S
Mol. Mass.474.613
SMILESCCCC[C@]1(CC)CS(=O)(=O)c2cc(CNCC(O)=O)c(OC)cc2[C@H](N1)c1ccccc1