Reaction Details
TargetIleal sodium/bile acid cotransporter
LigandBDBM50434864
Substrate/Competitorn/a
Meas. Tech.ChEMBL_963360 (CHEMBL2388857)
IC50 11±n/a nM
Citation Wu, YAquino, CJCowan, DJAnderson, DLAmbroso, JLBishop, MJBoros, EEChen, LCunningham, ADobbins, RLFeldman, PLHarston, LTKaldor, IWKlein, RLiang, XMcIntyre, MSMerrill, CLPatterson, KMPrescott, JSRay, JSRoller, SGYao, XYoung, AYuen, JCollins, JL Discovery of a highly potent, nonabsorbable apical sodium-dependent bile acid transporter inhibitor (GSK2330672) for treatment of type 2 diabetes. J Med Chem56:5094-114 (2013) 
 
Ileal sodium/bile acid cotransporter
Name:Ileal sodium/bile acid cotransporter
Type:Enzyme
Mol. Mass.:37714.89
Organism:Homo sapiens (Human)
Description:SLC10A2
Residue:348
BDBM50434864
NameBDBM50434864
Synonyms:CHEMBL2387420 | US9040518, 2
TypeSmall organic molecule
Emp. Form.C24H32N2O7S2
Mol. Mass.524.65
SMILESCCCC[C@]1(CC)CS(=O)(=O)c2cc(C(=O)NCS(O)(=O)=O)c(OC)cc2[C@H](N1)c1ccccc1