Reaction Details
TargetQuinolone resistance protein NorA
LigandBDBM50434966
Substrate/Competitorn/a
Meas. Tech.ChEMBL_961221 (CHEMBL2390113)
IC50 9200±n/a nM
Citation Sabatini, SGosetto, FIraci, NBarreca, MLMassari, SSancineto, LManfroni, GTabarrini, ODimovska, MKaatz, GWCecchetti, V Re-evolution of the 2-phenylquinolines: ligand-based design, synthesis, and biological evaluation of a potent new class of Staphylococcus aureus NorA efflux pump inhibitors to combat antimicrobial resistance. J Med Chem56:4975-89 (2013) 
 
Quinolone resistance protein NorA
Name:Quinolone resistance protein NorA
Type:PROTEIN
Mol. Mass.:42273.03
Organism:Staphylococcus aureus
Description:ChEMBL_961221
Residue:388
BDBM50434966
NameBDBM50434966
Synonyms:CHEMBL2385691
TypeSmall organic molecule
Emp. Form.C28H38N2O2
Mol. Mass.434.6135
SMILESCCCCN(CCCC)CCOc1cc(nc2ccccc12)-c1ccc(OCCC)cc1