Reaction Details
TargetQuinolone resistance protein NorA
LigandBDBM50434973
Substrate/Competitorn/a
Meas. Tech.ChEMBL_961221 (CHEMBL2390113)
IC50 3900±n/a nM
Citation Sabatini, SGosetto, FIraci, NBarreca, MLMassari, SSancineto, LManfroni, GTabarrini, ODimovska, MKaatz, GWCecchetti, V Re-evolution of the 2-phenylquinolines: ligand-based design, synthesis, and biological evaluation of a potent new class of Staphylococcus aureus NorA efflux pump inhibitors to combat antimicrobial resistance. J Med Chem56:4975-89 (2013) 
 
Quinolone resistance protein NorA
Name:Quinolone resistance protein NorA
Type:PROTEIN
Mol. Mass.:42273.03
Organism:Staphylococcus aureus
Description:ChEMBL_961221
Residue:388
BDBM50434973
NameBDBM50434973
Synonyms:CHEMBL2385681
TypeSmall organic molecule
Emp. Form.C23H28N2O2
Mol. Mass.364.4806
SMILESCCCOc1ccc(cc1)-c1cc(OCCCN(C)C)c2ccccc2n1