Reaction Details
TargetAromatase
LigandBDBM50435004
Substrate/Competitorn/a
Meas. Tech.ChEMBL_962577 (CHEMBL2387862)
Ki 442±n/a nM
Citation Lv, WLiu, JLu, DFlockhart, DACushman, M Synthesis of mixed (E,Z)-, (E)-, and (Z)-norendoxifen with dual aromatase inhibitory and estrogen receptor modulatory activities. J Med Chem56:4611-8 (2013) 
 
Aromatase
Name:Aromatase
Type:Enzyme
Mol. Mass.:57888.92
Organism:Homo sapiens (Human)
Description:P11511
Residue:503
BDBM50435004
NameBDBM50435004
Synonyms:CHEMBL2386284
TypeSmall organic molecule
Emp. Form.C24H25NO2
Mol. Mass.359.4608
SMILESCC\C(=C(/c1ccc(O)cc1)c1ccc(OCCN)cc1)c1ccccc1