Reaction Details
TargetP2Y purinoceptor 11
LigandBDBM50435008
Substrate/Competitorn/a
Meas. Tech.ChEMBL_963120 (CHEMBL2390599)
EC50 130±n/a nM
Citation Azran, SFörster, DDanino, ONadel, YReiser, GFischer, B Highly efficient biocompatible neuroprotectants with dual activity as antioxidants and P2Y receptor agonists. J Med Chem56:4938-52 (2013) 
 
P2Y purinoceptor 11
Name:P2Y purinoceptor 11
Type:PROTEIN
Mol. Mass.:40366.02
Organism:Homo sapiens (Human)
Description:ChEMBL_1362532
Residue:374
BDBM50435008
NameBDBM50435008
Synonyms:CHEMBL2386496
TypeSmall organic molecule
Emp. Form.C11H16BCl3N5O11P3
Mol. Mass.604.363
SMILESB[P@](=O)(OC[C@H]1O[C@H]([C@H](O)[C@@H]1O)n1cnc2c(N)nc(Cl)nc12)OP(O)(=O)C(Cl)(Cl)P(O)(O)=O