Reaction Details
TargetP2Y purinoceptor 11
LigandBDBM50398070
Substrate/Competitorn/a
Meas. Tech.ChEMBL_963120 (CHEMBL2390599)
EC50 2900±n/a nM
Citation Azran, SFörster, DDanino, ONadel, YReiser, GFischer, B Highly efficient biocompatible neuroprotectants with dual activity as antioxidants and P2Y receptor agonists. J Med Chem56:4938-52 (2013) 
 
P2Y purinoceptor 11
Name:P2Y purinoceptor 11
Type:PROTEIN
Mol. Mass.:40366.02
Organism:Homo sapiens (Human)
Description:ChEMBL_1362532
Residue:374
BDBM50398070
NameBDBM50398070
Synonyms:CHEMBL2181938
TypeSmall organic molecule
Emp. Form.C10H15BN5O9P2
Mol. Mass.422.014
SMILES[BH3-][P@](=O)(OC[C@H]1O[C@H]([C@H](O)[C@@H]1O)n1cnc2c(N)ncnc12)OP([O-])([O-])=O