Reaction Details
TargetP2Y purinoceptor 11
LigandBDBM50366480
Substrate/Competitorn/a
Meas. Tech.ChEMBL_963120 (CHEMBL2390599)
EC50 6700±n/a nM
Citation Azran, SFörster, DDanino, ONadel, YReiser, GFischer, B Highly efficient biocompatible neuroprotectants with dual activity as antioxidants and P2Y receptor agonists. J Med Chem56:4938-52 (2013) 
 
P2Y purinoceptor 11
Name:P2Y purinoceptor 11
Type:PROTEIN
Mol. Mass.:40366.02
Organism:Homo sapiens (Human)
Description:ChEMBL_1362532
Residue:374
BDBM50366480
NameBDBM50366480
Synonyms:ADENOSINE TRIPHOSPHATE | ATP
TypeSmall organic molecule
Emp. Form.C10H16N5O13P3
Mol. Mass.507.181
SMILESNc1ncnc2n(cnc12)[C@@H]1O[C@H](CO[P@](O)(=O)O[P@@](O)(=O)OP(O)(O)=O)[C@@H](O)[C@H]1O