Reaction Details
TargetCasein kinase I isoform epsilon
LigandBDBM50435030
Substrate/Competitorn/a
Meas. Tech.ChEMBL_964507 (CHEMBL2393652)
IC50>100000±n/a nM
Citation Lo Monte, FKramer, TGu, JBrodrecht, MPilakowski, JFuertes, ADominguez, JMPlotkin, BEldar-Finkelman, HSchmidt, B Structure-based optimization of oxadiazole-based GSK-3 inhibitors. Eur J Med Chem61:26-40 (2013) 
 
Casein kinase I isoform epsilon
Name:Casein kinase I isoform epsilon
Type:Protein
Mol. Mass.:47340.25
Organism:Homo sapiens (Human)
Description:P49674
Residue:416
BDBM50435030
NameBDBM50435030
Synonyms:CHEMBL2390958
TypeSmall organic molecule
Emp. Form.C21H14N4OS
Mol. Mass.370.427
SMILESN#Cc1ccc(cc1)-c1ccc(CSc2nnc(o2)-c2ccncc2)cc1