Reaction Details
TargetCyclin-dependent kinase 5
LigandBDBM50435028
Substrate/Competitorn/a
Meas. Tech.ChEMBL_964508 (CHEMBL2393653)
IC50>100000±n/a nM
Citation Lo Monte, FKramer, TGu, JBrodrecht, MPilakowski, JFuertes, ADominguez, JMPlotkin, BEldar-Finkelman, HSchmidt, B Structure-based optimization of oxadiazole-based GSK-3 inhibitors. Eur J Med Chem61:26-40 (2013) 
 
Cyclin-dependent kinase 5
Name:Cyclin-dependent kinase 5
Type:Enzyme Subunit
Mol. Mass.:33308.61
Organism:Homo sapiens (Human)
Description:n/a
Residue:292
BDBM50435028
NameBDBM50435028
Synonyms:CHEMBL2391098
TypeSmall organic molecule
Emp. Form.C21H13FN4OS
Mol. Mass.388.418
SMILESFc1ccc(-c2ccc(CSc3nnc(o3)-c3ccncc3)cc2)c(c1)C#N