Reaction Details
TargetCyclin-dependent kinase 5
LigandBDBM50435029
Substrate/Competitorn/a
Meas. Tech.ChEMBL_964508 (CHEMBL2393653)
IC50>100000±n/a nM
Citation Lo Monte, FKramer, TGu, JBrodrecht, MPilakowski, JFuertes, ADominguez, JMPlotkin, BEldar-Finkelman, HSchmidt, B Structure-based optimization of oxadiazole-based GSK-3 inhibitors. Eur J Med Chem61:26-40 (2013) 
 
Cyclin-dependent kinase 5
Name:Cyclin-dependent kinase 5
Type:Enzyme Subunit
Mol. Mass.:33308.61
Organism:Homo sapiens (Human)
Description:n/a
Residue:292
BDBM50435029
NameBDBM50435029
Synonyms:CHEMBL2391131
TypeSmall organic molecule
Emp. Form.C21H17N3O2S
Mol. Mass.375.444
SMILESCOc1ccc(cc1)-c1ccc(CSc2nnc(o2)-c2ccncc2)cc1