Reaction Details
TargetCasein kinase I isoform epsilon
LigandBDBM50435039
Substrate/Competitorn/a
Meas. Tech.ChEMBL_964507 (CHEMBL2393652)
IC50 50000±n/a nM
Citation Lo Monte, FKramer, TGu, JBrodrecht, MPilakowski, JFuertes, ADominguez, JMPlotkin, BEldar-Finkelman, HSchmidt, B Structure-based optimization of oxadiazole-based GSK-3 inhibitors. Eur J Med Chem61:26-40 (2013) 
 
Casein kinase I isoform epsilon
Name:Casein kinase I isoform epsilon
Type:Protein
Mol. Mass.:47340.25
Organism:Homo sapiens (Human)
Description:P49674
Residue:416
BDBM50435039
NameBDBM50435039
Synonyms:CHEMBL2391118
TypeSmall organic molecule
Emp. Form.C24H17N3O4S
Mol. Mass.443.474
SMILESCOc1ccc(-c2ccc(CSc3nnc(o3)-c3ccc4OCOc4c3)cc2)c(c1)C#N