Reaction Details
TargetAurora kinase A
LigandBDBM50435025
Substrate/Competitorn/a
Meas. Tech.ChEMBL_964506 (CHEMBL2393651)
IC50>100000±n/a nM
Citation Lo Monte, FKramer, TGu, JBrodrecht, MPilakowski, JFuertes, ADominguez, JMPlotkin, BEldar-Finkelman, HSchmidt, B Structure-based optimization of oxadiazole-based GSK-3 inhibitors. Eur J Med Chem61:26-40 (2013) 
 
Aurora kinase A
Name:Aurora kinase A
Type:Serine/threonine-protein kinase
Mol. Mass.:45830.98
Organism:Homo sapiens (Human)
Description:O14965
Residue:403
BDBM50435025
NameBDBM50435025
Synonyms:CHEMBL2391101
TypeSmall organic molecule
Emp. Form.C17H13N5O2S
Mol. Mass.351.382
SMILESCC(=O)Nc1cc(ccn1)-c1nnc(SCc2cccc(c2)C#N)o1