Reaction Details
TargetAurora kinase A
LigandBDBM50435027
Substrate/Competitorn/a
Meas. Tech.ChEMBL_964506 (CHEMBL2393651)
IC50>100000±n/a nM
Citation Lo Monte, FKramer, TGu, JBrodrecht, MPilakowski, JFuertes, ADominguez, JMPlotkin, BEldar-Finkelman, HSchmidt, B Structure-based optimization of oxadiazole-based GSK-3 inhibitors. Eur J Med Chem61:26-40 (2013) 
 
Aurora kinase A
Name:Aurora kinase A
Type:Serine/threonine-protein kinase
Mol. Mass.:45830.98
Organism:Homo sapiens (Human)
Description:O14965
Residue:403
BDBM50435027
NameBDBM50435027
Synonyms:CHEMBL2391099
TypeSmall organic molecule
Emp. Form.C20H15N3OS
Mol. Mass.345.418
SMILESC(Sc1nnc(o1)-c1ccncc1)c1ccc(cc1)-c1ccccc1