Reaction Details
TargetAurora kinase A
LigandBDBM50435034
Substrate/Competitorn/a
Meas. Tech.ChEMBL_964506 (CHEMBL2393651)
IC50>100000±n/a nM
Citation Lo Monte, FKramer, TGu, JBrodrecht, MPilakowski, JFuertes, ADominguez, JMPlotkin, BEldar-Finkelman, HSchmidt, B Structure-based optimization of oxadiazole-based GSK-3 inhibitors. Eur J Med Chem61:26-40 (2013) 
 
Aurora kinase A
Name:Aurora kinase A
Type:Serine/threonine-protein kinase
Mol. Mass.:45830.98
Organism:Homo sapiens (Human)
Description:O14965
Residue:403
BDBM50435034
NameBDBM50435034
Synonyms:CHEMBL2391121
TypeSmall organic molecule
Emp. Form.C23H15N3O3S
Mol. Mass.413.449
SMILESN#Cc1cccc(c1)-c1ccc(CSc2nnc(o2)-c2ccc3OCOc3c2)cc1