Reaction Details
TargetGamma-aminobutyric acid type B receptor subunit 1
LigandBDBM50435128
Substrate/Competitorn/a
Meas. Tech.ChEMBL_965462 (CHEMBL2395266)
IC50 6.4±n/a nM
Citation Germain, ARCarmody, LCNag, PPMorgan, BVerplank, LFernandez, CDonckele, EFeng, YPerez, JRDandapani, SPalmer, MLander, ESGupta, PBSchreiber, SLMunoz, B Cinnamides as selective small-molecule inhibitors of a cellular model of breast cancer stem cells. Bioorg Med Chem Lett23:1834-8 (2013) 
 
Gamma-aminobutyric acid type B receptor subunit 1
Name:Gamma-aminobutyric acid type B receptor subunit 1
Type:Enzyme Catalytic Domain
Mol. Mass.:108337.22
Organism:Homo sapiens (Human)
Description:Q9UBS5
Residue:961
BDBM50435128
NameBDBM50435128
Synonyms:CHEMBL2391908
TypeSmall organic molecule
Emp. Form.C18H28Cl2NO3P
Mol. Mass.408.3
SMILESC[C@H](NCC(=O)CP(O)(O)CC1CCCCC1)c1ccc(Cl)c(Cl)c1