Reaction Details
TargetNeuromedin-K receptor
LigandBDBM50051295
Substrate/Competitorn/a
Meas. Tech.ChEMBL_966055 (CHEMBL2394944)
IC50 7.1±n/a nM
Citation Cappelli, AManini, MValenti, SCastriconi, FGiuliani, GAnzini, MBrogi, SButini, SGemma, SCampiani, GGiorgi, GMennuni, LLanza, MGiordani, ACaselli, GLetari, OMakovec, F Synthesis and structure-activity relationship studies in serotonin 5-HT(1A) receptor agonists based on fused pyrrolidone scaffolds. Eur J Med Chem63:85-94 (2013) 
 
Neuromedin-K receptor
Name:Neuromedin-K receptor
Type:Enzyme
Mol. Mass.:52221.96
Organism:Homo sapiens (Human)
Description:P29371
Residue:465
BDBM50051295
NameBDBM50051295
Synonyms:(S)-3-methyl-2-phenyl-N-(1-phenylpropyl)quinoline-4-carboxamide CHEMBL10284 | SB-222200
TypeSmall organic molecule
Emp. Form.C26H24N2O
Mol. Mass.380.4816
SMILESCC[C@H](NC(=O)c1c(C)c(nc2ccccc12)-c1ccccc1)c1ccccc1