Reaction Details
TargetGalanin receptor type 1
LigandBDBM50378616
Substrate/Competitorn/a
Meas. Tech.ChEMBL_966187 (CHEMBL2395692)
IC50 0.770000±n/a nM
Citation Cappelli, AManini, MValenti, SCastriconi, FGiuliani, GAnzini, MBrogi, SButini, SGemma, SCampiani, GGiorgi, GMennuni, LLanza, MGiordani, ACaselli, GLetari, OMakovec, F Synthesis and structure-activity relationship studies in serotonin 5-HT(1A) receptor agonists based on fused pyrrolidone scaffolds. Eur J Med Chem63:85-94 (2013) 
 
Galanin receptor type 1
Name:Galanin receptor type 1
Type:Enzyme Catalytic Domain
Mol. Mass.:38976.60
Organism:Homo sapiens (Human)
Description:Galanin R1 GALR1 HUMAN::P47211
Residue:349
BDBM50378616
NameBDBM50378616
Synonyms:GALANIN
TypeSmall organic molecule
Emp. Form.C146H213N43O40
Mol. Mass.3210.5175
SMILESCC[C@H](C)[C@H](NC(=O)[C@H](C)NC(=O)[C@H](Cc1cnc[nH]1)NC(=O)[C@@H]1CCCN1C(=O)CNC(=O)[C@H](CC(C)C)NC(=O)[C@H](CC(C)C)NC(=O)[C@H](Cc1ccc(O)cc1)NC(=O)CNC(=O)[C@H](C)NC(=O)[C@H](CO)NC(=O)[C@H](CC(N)=O)NC(=O)[C@H](CC(C)C)NC(=O)[C@@H](NC(=O)[C@H](Cc1c[nH]c2ccccc12)NC(=O)CN)[C@@H](C)O)C(=O)N[C@@H](CC(O)=O)C(=O)N[C@@H](CC(N)=O)C(=O)N[C@@H](Cc1cnc[nH]1)C(=O)N[C@@H](CCCN=C(N)N)C(=O)N[C@@H](CO)C(=O)N[C@@H](Cc1ccccc1)C(=O)N[C@@H](Cc1cnc[nH]1)C(=O)N[C@@H](CC(O)=O)C(=O)N[C@@H](CCCCN)C(=O)N[C@@H](Cc1ccc(O)cc1)C(=O)NCC(=O)N[C@@H](CC(C)C)C(=O)N[C@@H](C)C(N)=O