Reaction Details
TargetMicrotubule-associated protein 2
LigandBDBM50435207
Substrate/Competitorn/a
Meas. Tech.ChEMBL_963502 (CHEMBL2394383)
EC50 1700±n/a nM
Citation Zhang, PYang, XZhang, FGabelli, SBWang, RZhang, YBhat, SChen, XFurlani, MAmzel, LMLiu, JOMa, D Pyridinylpyrimidines selectively inhibit human methionine aminopeptidase-1. Bioorg Med Chem21:2600-17 (2013) 
 
Microtubule-associated protein 2
Name:Microtubule-associated protein 2
Type:PROTEIN
Mol. Mass.:199423.64
Organism:Homo sapiens (Human)
Description:ChEMBL_107603
Residue:1827
BDBM50435207
NameBDBM50435207
Synonyms:CHEMBL2392910
TypeSmall organic molecule
Emp. Form.C28H37ClN8O
Mol. Mass.537.099
SMILESCN(C)c1ccc(nc1)-c1nc(C)c(Cl)c(NC[C@H](NC(=O)CCCN2CCNCC2)c2ccccc2)n1