Reaction Details
TargetMicrotubule-associated protein 2
LigandBDBM50435208
Substrate/Competitorn/a
Meas. Tech.ChEMBL_963502 (CHEMBL2394383)
EC50 14000±n/a nM
Citation Zhang, PYang, XZhang, FGabelli, SBWang, RZhang, YBhat, SChen, XFurlani, MAmzel, LMLiu, JOMa, D Pyridinylpyrimidines selectively inhibit human methionine aminopeptidase-1. Bioorg Med Chem21:2600-17 (2013) 
 
Microtubule-associated protein 2
Name:Microtubule-associated protein 2
Type:PROTEIN
Mol. Mass.:199423.64
Organism:Homo sapiens (Human)
Description:ChEMBL_107603
Residue:1827
BDBM50435208
NameBDBM50435208
Synonyms:CHEMBL2392909
TypeSmall organic molecule
Emp. Form.C26H31ClN8O3
Mol. Mass.539.029
SMILESCc1nc(nc(NC[C@H](NC(=O)CCCN2CCNCC2)c2ccccc2)c1Cl)-c1ccc(cn1)[N+]([O-])=O