Reaction Details
TargetMicrotubule-associated protein 2
LigandBDBM50435217
Substrate/Competitorn/a
Meas. Tech.ChEMBL_963502 (CHEMBL2394383)
IC50 95000±n/a nM
Citation Zhang, PYang, XZhang, FGabelli, SBWang, RZhang, YBhat, SChen, XFurlani, MAmzel, LMLiu, JOMa, D Pyridinylpyrimidines selectively inhibit human methionine aminopeptidase-1. Bioorg Med Chem21:2600-17 (2013) 
 
Microtubule-associated protein 2
Name:Microtubule-associated protein 2
Type:PROTEIN
Mol. Mass.:199423.64
Organism:Homo sapiens (Human)
Description:ChEMBL_107603
Residue:1827
BDBM50435217
NameBDBM50435217
Synonyms:CHEMBL2392900
TypeSmall organic molecule
Emp. Form.C26H34ClN7O3S
Mol. Mass.560.111
SMILESCc1nc(nc(NC[C@H](NS(=O)(=O)CCN2CCN(CCO)CC2)c2ccccc2)c1Cl)-c1ccccn1