Reaction Details
TargetMicrotubule-associated protein 2
LigandBDBM50435227
Substrate/Competitorn/a
Meas. Tech.ChEMBL_963502 (CHEMBL2394383)
IC50>100000±n/a nM
Citation Zhang, PYang, XZhang, FGabelli, SBWang, RZhang, YBhat, SChen, XFurlani, MAmzel, LMLiu, JOMa, D Pyridinylpyrimidines selectively inhibit human methionine aminopeptidase-1. Bioorg Med Chem21:2600-17 (2013) 
 
Microtubule-associated protein 2
Name:Microtubule-associated protein 2
Type:PROTEIN
Mol. Mass.:199423.64
Organism:Homo sapiens (Human)
Description:ChEMBL_107603
Residue:1827
BDBM50435227
NameBDBM50435227
Synonyms:CHEMBL2392772
TypeSmall organic molecule
Emp. Form.C21H19Cl2F3N6
Mol. Mass.483.317
SMILESCc1nc(nc(NC2CCN(CC2)c2ncc(cc2Cl)C(F)(F)F)c1Cl)-c1ccccn1