Reaction Details
TargetMicrotubule-associated protein 2
LigandBDBM50435231
Substrate/Competitorn/a
Meas. Tech.ChEMBL_963502 (CHEMBL2394383)
IC50 13000±n/a nM
Citation Zhang, PYang, XZhang, FGabelli, SBWang, RZhang, YBhat, SChen, XFurlani, MAmzel, LMLiu, JOMa, D Pyridinylpyrimidines selectively inhibit human methionine aminopeptidase-1. Bioorg Med Chem21:2600-17 (2013) 
 
Microtubule-associated protein 2
Name:Microtubule-associated protein 2
Type:PROTEIN
Mol. Mass.:199423.64
Organism:Homo sapiens (Human)
Description:ChEMBL_107603
Residue:1827
BDBM50435231
NameBDBM50435231
Synonyms:CHEMBL2392769
TypeSmall organic molecule
Emp. Form.C18H17ClN4
Mol. Mass.324.807
SMILESCN(Cc1ccccc1)c1nc(nc(C)c1Cl)-c1ccccn1