Reaction Details
TargetMicrotubule-associated protein 2
LigandBDBM50435236
Substrate/Competitorn/a
Meas. Tech.ChEMBL_963502 (CHEMBL2394383)
IC50>100000±n/a nM
Citation Zhang, PYang, XZhang, FGabelli, SBWang, RZhang, YBhat, SChen, XFurlani, MAmzel, LMLiu, JOMa, D Pyridinylpyrimidines selectively inhibit human methionine aminopeptidase-1. Bioorg Med Chem21:2600-17 (2013) 
 
Microtubule-associated protein 2
Name:Microtubule-associated protein 2
Type:PROTEIN
Mol. Mass.:199423.64
Organism:Homo sapiens (Human)
Description:ChEMBL_107603
Residue:1827
BDBM50435236
NameBDBM50435236
Synonyms:CHEMBL2392765
TypeSmall organic molecule
Emp. Form.C19H20N4
Mol. Mass.304.3889
SMILESCc1nc(nc(NCCc2ccccc2)c1C)-c1ccccn1