Reaction Details
TargetMethionine aminopeptidase 1
LigandBDBM50433377
Substrate/Competitorn/a
Meas. Tech.ChEMBL_963503 (CHEMBL2394384)
IC50 2000±n/a nM
Citation Zhang, PYang, XZhang, FGabelli, SBWang, RZhang, YBhat, SChen, XFurlani, MAmzel, LMLiu, JOMa, D Pyridinylpyrimidines selectively inhibit human methionine aminopeptidase-1. Bioorg Med Chem21:2600-17 (2013) 
 
Methionine aminopeptidase 1
Name:Methionine aminopeptidase 1
Type:Enzyme
Mol. Mass.:43220.79
Organism:Homo sapiens (Human)
Description:MetAP1 with an N-terminal six histidine tag was expressed in baculovirus infected sf9 cells.
Residue:386
BDBM50433377
NameBDBM50433377
Synonyms:CHEMBL2375628
TypeSmall organic molecule
Emp. Form.C18H16ClF3N6
Mol. Mass.408.808
SMILESCc1nc(nc(NCCNc2ccc(cn2)C(F)(F)F)c1Cl)-c1ccccn1