Reaction Details
TargetMethionine aminopeptidase 1
LigandBDBM50435230
Substrate/Competitorn/a
Meas. Tech.ChEMBL_963503 (CHEMBL2394384)
IC50 8900±n/a nM
Citation Zhang, PYang, XZhang, FGabelli, SBWang, RZhang, YBhat, SChen, XFurlani, MAmzel, LMLiu, JOMa, D Pyridinylpyrimidines selectively inhibit human methionine aminopeptidase-1. Bioorg Med Chem21:2600-17 (2013) 
 
Methionine aminopeptidase 1
Name:Methionine aminopeptidase 1
Type:Enzyme
Mol. Mass.:43220.79
Organism:Homo sapiens (Human)
Description:MetAP1 with an N-terminal six histidine tag was expressed in baculovirus infected sf9 cells.
Residue:386
BDBM50435230
NameBDBM50435230
Synonyms:CHEMBL2392770
TypeSmall organic molecule
Emp. Form.C11H11ClN4
Mol. Mass.234.685
SMILESCNc1nc(nc(C)c1Cl)-c1ccccn1